BDBM314888 N-(3-((1R,5S,6R)-3-amino-5-(difluoromethyl)-2-oxa-4-azabicyclo[4.1.0]hept-3-en-5-yl)-4-fluorophenyl)-5-((3-cyclopropylprop-2-yn-1-yl)oxy)pyrazine-2-carboxamide ::US9611261, Example 411
SMILES NC1=N[C@@](C(F)F)([C@H]2C[C@H]2O1)c1cc(NC(=O)c2cnc(CCC#CC3CC3)cn2)ccc1F
InChI Key InChIKey=CXUPBTMUQGUGAD-WPSZSDGUSA-N
Data  2 IC50
  Tab Delimited (TSV)   2D SDfile   Computed 3D by Vconf -m prep SDfile
Find this compound or compounds like it in BindingDB:
Activity Spreadsheet -- Enzyme Inhibition Constant Data from BindingDB
Found 2 hits for monomerid = 314888
TargetCathepsin D(Homo sapiens (Human))
Amgen
US Patent
LigandPNGBDBM314888(N-(3-((1R,5S,6R)-3-amino-5-(difluoromethyl)-2-oxa-...)
Affinity DataIC50:  3.60E+5nM. Assay description: Recombinant Cat D was expressed in CHO cells. The assay buffer for CathepsinD is 0.05 M citrate pH 3.5, 10% DMSO final, 5 mM CHAPS. The Cat D enzyme ...
Ligand InfoPC cidPC sid
In DepthDetails US Patent
TargetBeta-secretase 1(Homo sapiens (Human))
Amgen
US Patent
LigandPNGBDBM314888(N-(3-((1R,5S,6R)-3-amino-5-(difluoromethyl)-2-oxa-...)
Affinity DataIC50:  7.60nM. Assay description: The assay buffer used in this screen is 0.05 M acetate, pH 4.2, 10% DMSO final, 100 uM genapol (which is a nonionic detergent, below its Critical Mic...
Ligand InfoPC cidPC sid
In DepthDetails US Patent