BDBM315313 3-{1-[2-(3-Fluoro-4- trifluoromethyl-phenyl)- 5-methyl-1H-imidazol-4- ylmethyl]-piperidin-4- yl}-3,4-dihydro-1H- quinazolin-2-one::US10172843, Example 47
SMILES Cc1[nH]c(nc1CN1CCC(CC1)N1Cc2ccccc2NC1=O)-c1ccc(c(F)c1)C(F)(F)F
InChI Key InChIKey=WQYYASOOCUOIDU-UHFFFAOYSA-N
Data  1 IC50
  Tab Delimited (TSV)   2D SDfile   Computed 3D by Vconf -m prep SDfile
Find this compound or compounds like it in BindingDB:
Activity Spreadsheet -- Enzyme Inhibition Constant Data from BindingDB
Found 1 hit for monomerid = 315313
TargetCathepsin S(Homo sapiens (Human))
Hoffmann-La Roche
US Patent
LigandPNGBDBM315313(3-{1-[2-(3-Fluoro-4- trifluoromethyl-phenyl)- 5-me...)
Affinity DataIC50:  145nM. Assay description: Enzyme activity is measured by observing the increase in fluorescence intensity caused by cleavage of a peptide substrate containing a fluorophore wh...
Ligand InfoPC cidPC sid
In DepthDetails US Patent