BDBM315330 1-Methyl-3-{1-[5-propyl- 2-(4-trifluoromethyl- phenyl)-1H-imidazol-4- ylmethyl]-piperidin-4- yl}-1,3-dihydro- benzoimidazol-2-one::US10172843, Example 64
SMILES CCCc1[nH]c(nc1CN1CCC(CC1)n1c2ccccc2n(C)c1=O)-c1ccc(cc1)C(F)(F)F
InChI Key InChIKey=PCDYHFBXEJZNNS-UHFFFAOYSA-N
Data  1 IC50
  Tab Delimited (TSV)   2D SDfile   Computed 3D by Vconf -m prep SDfile
Find this compound or compounds like it in BindingDB:
Activity Spreadsheet -- Enzyme Inhibition Constant Data from BindingDB
Found 1 hit for monomerid = 315330
TargetCathepsin S(Homo sapiens (Human))
Hoffmann-La Roche
US Patent
LigandPNGBDBM315330(1-Methyl-3-{1-[5-propyl- 2-(4-trifluoromethyl- phe...)
Affinity DataIC50:  928nM. Assay description: Enzyme activity is measured by observing the increase in fluorescence intensity caused by cleavage of a peptide substrate containing a fluorophore wh...
Ligand InfoPC cidPC sid
In DepthDetails US Patent