BDBM315351 US10172856, Example 4
SMILES CCOc1cc(F)ccc1N(Cc1ccccc1)c1ccnc(N)n1
InChI Key InChIKey=HCIKFKWJEDHTPA-UHFFFAOYSA-N
Data  1 KI
  Tab Delimited (TSV)   2D SDfile   Computed 3D by Vconf -m prep SDfile
Find this compound or compounds like it in BindingDB:
Activity Spreadsheet -- Enzyme Inhibition Constant Data from BindingDB
Found 1 hit for monomerid = 315351
TargetHistamine H4 receptor(Homo sapiens (Human))
Janssen Pharmaceutica
US Patent
LigandPNGBDBM315351(US10172856, Example 4)
Affinity DataKi:  12nM. Assay description: Receptor binding was assessed using isolated plasma membranes from SKNMC neuroblastoma cell lines stably expressing recombinant human H4 receptor. To...
Ligand InfoPC cidPC sid
In DepthDetails US Patent