BDBM315368 US10172856, Example 21
SMILES CCN(c1ccnc(N)n1)c1ccc(cc1C1CCC1)S(C)(=O)=O
InChI Key InChIKey=GFIURDXULULYBG-UHFFFAOYSA-N
Data  1 KI
  Tab Delimited (TSV)   2D SDfile   Computed 3D by Vconf -m prep SDfile
Find this compound or compounds like it in BindingDB:
Activity Spreadsheet -- Enzyme Inhibition Constant Data from BindingDB
Found 1 hit for monomerid = 315368
TargetHistamine H4 receptor(Homo sapiens (Human))
Janssen Pharmaceutica
US Patent
LigandPNGBDBM315368(US10172856, Example 21)
Affinity DataKi:  39nM. Assay description: Receptor binding was assessed using isolated plasma membranes from SKNMC neuroblastoma cell lines stably expressing recombinant human H4 receptor. To...
Ligand InfoPC cidPC sid
In DepthDetails US Patent