BDBM315448 US10172856, Example 100
SMILES C\C=C\c1cc(ccc1N(C(C)C)c1ccnc(N)n1)C(N)=O
InChI Key InChIKey=KTDZQDYLIAQILD-SNAWJCMRSA-N
Data  1 KI
  Tab Delimited (TSV)   2D SDfile   Computed 3D by Vconf -m prep SDfile
Find this compound or compounds like it in BindingDB:
Activity Spreadsheet -- Enzyme Inhibition Constant Data from BindingDB
Found 1 hit for monomerid = 315448
TargetHistamine H4 receptor(Homo sapiens (Human))
Janssen Pharmaceutica
US Patent
LigandPNGBDBM315448(US10172856, Example 100)
Affinity DataKi:  66nM. Assay description: Receptor binding was assessed using isolated plasma membranes from SKNMC neuroblastoma cell lines stably expressing recombinant human H4 receptor. To...
Ligand InfoPC cidPC sid
In DepthDetails US Patent