BDBM315481 US10172858, Table 1.5
SMILES Nc1nc2cc(ccc2o1)-c1nn(C2CCOCC2)c2ncnc(N)c12
InChI Key InChIKey=DSPUBRSXSQDQMB-UHFFFAOYSA-N
Data  5 IC50
  Tab Delimited (TSV)   2D SDfile   Computed 3D by Vconf -m prep SDfile
Find this compound or compounds like it in BindingDB:
Activity Spreadsheet -- Enzyme Inhibition Constant Data from BindingDB
Found 5 hits for monomerid = 315481
TargetSerine/threonine-protein kinase mTOR(Homo sapiens (Human))
Intellikine
US Patent
LigandPNGBDBM315481(US10172858, Table 1.5)
Affinity DataIC50: <100nM. Assay description: This assay is relatively simple, reasonably sensitive, and the peptide substrate can be adjusted both in terms of sequence and concentration to meet ...
Ligand InfoPC cidPC sid
In DepthDetails US Patent
TargetPhosphatidylinositol 3-kinase regulatory subunit alpha(Homo sapiens (Human))
Intellikine
US Patent
LigandPNGBDBM315481(US10172858, Table 1.5)
Affinity DataIC50: <1.00E+3nM. Assay description: This assay is relatively simple, reasonably sensitive, and the peptide substrate can be adjusted both in terms of sequence and concentration to meet ...
Ligand InfoPC cidPC sid
In DepthDetails US Patent
LigandPNGBDBM315481(US10172858, Table 1.5)
Affinity DataIC50: <1.00E+3nM. Assay description: This assay is relatively simple, reasonably sensitive, and the peptide substrate can be adjusted both in terms of sequence and concentration to meet ...
Ligand InfoPC cidPC sid
In DepthDetails US Patent
LigandPNGBDBM315481(US10172858, Table 1.5)
Affinity DataIC50: <100nM. Assay description: This assay is relatively simple, reasonably sensitive, and the peptide substrate can be adjusted both in terms of sequence and concentration to meet ...
Ligand InfoPC cidPC sid
In DepthDetails US Patent
TargetPhosphatidylinositol 3-kinase regulatory subunit beta(Homo sapiens (Human))
Intellikine
US Patent
LigandPNGBDBM315481(US10172858, Table 1.5)
Affinity DataIC50: <1.00E+4nM. Assay description: This assay is relatively simple, reasonably sensitive, and the peptide substrate can be adjusted both in terms of sequence and concentration to meet ...
Ligand InfoPC cidPC sid
In DepthDetails US Patent