BDBM315546 US10172858, Table 2.41::US9828378, # 41
SMILES Nc1ncnc2n(nc(-c3cc4cccc(O)c4[nH]3)c12)C1CCN(CC1)C(=O)C1CC1
InChI Key InChIKey=HIAFGFKTYNYUOY-UHFFFAOYSA-N
Data  10 IC50
  Tab Delimited (TSV)   2D SDfile   Computed 3D by Vconf -m prep SDfile
Find this compound or compounds like it in BindingDB:
Activity Spreadsheet -- Enzyme Inhibition Constant Data from BindingDB
Found 10 hits for monomerid = 315546
TargetSerine/threonine-protein kinase mTOR(Homo sapiens (Human))
Intellikine
US Patent
LigandPNGBDBM315546(US10172858, Table 2.41 | US9828378, # 41)
Affinity DataIC50: <10nM. Assay description: This assay is relatively simple, reasonably sensitive, and the peptide substrate can be adjusted both in terms of sequence and concentration to meet ...
Ligand InfoPC cidPC sid
In DepthDetails US Patent
TargetPhosphatidylinositol 3-kinase regulatory subunit alpha(Homo sapiens (Human))
Intellikine
US Patent
LigandPNGBDBM315546(US10172858, Table 2.41 | US9828378, # 41)
Affinity DataIC50: >500nM. Assay description: This assay is relatively simple, reasonably sensitive, and the peptide substrate can be adjusted both in terms of sequence and concentration to meet ...
Ligand InfoPC cidPC sid
In DepthDetails US Patent
TargetPhosphatidylinositol 3-kinase regulatory subunit beta(Homo sapiens (Human))
Intellikine
US Patent
LigandPNGBDBM315546(US10172858, Table 2.41 | US9828378, # 41)
Affinity DataIC50: >500nM. Assay description: This assay is relatively simple, reasonably sensitive, and the peptide substrate can be adjusted both in terms of sequence and concentration to meet ...
Ligand InfoPC cidPC sid
In DepthDetails US Patent
LigandPNGBDBM315546(US10172858, Table 2.41 | US9828378, # 41)
Affinity DataIC50: <50nM. Assay description: This assay is relatively simple, reasonably sensitive, and the peptide substrate can be adjusted both in terms of sequence and concentration to meet ...
Ligand InfoPC cidPC sid
In DepthDetails US Patent
LigandPNGBDBM315546(US10172858, Table 2.41 | US9828378, # 41)
Affinity DataIC50: >500nM. Assay description: Class I PI3-Ks can be either purchased (p110α/p85α, p110β/p85α, p110δ/p85α from Upstate, and p110γ from Sigma) or...
Ligand InfoPC cidPC sid
In DepthDetails US Patent
TargetCytosolic arginine sensor for mTORC1 subunit 1(Homo sapiens (Human))
Intellikine
US Patent
LigandPNGBDBM315546(US10172858, Table 2.41 | US9828378, # 41)
Affinity DataIC50: <10nM. Assay description: Class I PI3-Ks can be either purchased (p110α/p85α, p110β/p85α, p110δ/p85α from Upstate, and p110γ from Sigma) or...
Ligand InfoPC cidPC sid
In DepthDetails US Patent
LigandPNGBDBM315546(US10172858, Table 2.41 | US9828378, # 41)
Affinity DataIC50: >500nM. Assay description: Class I PI3-Ks can be either purchased (p110α/p85α, p110β/p85α, p110δ/p85α from Upstate, and p110γ from Sigma) or...
Ligand InfoPC cidPC sid
In DepthDetails US Patent
LigandPNGBDBM315546(US10172858, Table 2.41 | US9828378, # 41)
Affinity DataIC50: >500nM. Assay description: Class I PI3-Ks can be either purchased (p110α/p85α, p110β/p85α, p110δ/p85α from Upstate, and p110γ from Sigma) or...
Ligand InfoPC cidPC sid
In DepthDetails US Patent
LigandPNGBDBM315546(US10172858, Table 2.41 | US9828378, # 41)
Affinity DataIC50: <50nM. Assay description: Class I PI3-Ks can be either purchased (p110α/p85α, p110β/p85α, p110δ/p85α from Upstate, and p110γ from Sigma) or...
Ligand InfoPC cidPC sid
In DepthDetails US Patent
LigandPNGBDBM315546(US10172858, Table 2.41 | US9828378, # 41)
Affinity DataIC50: >500nM. Assay description: This assay is relatively simple, reasonably sensitive, and the peptide substrate can be adjusted both in terms of sequence and concentration to meet ...
Ligand InfoPC cidPC sid
In DepthDetails US Patent