BDBM315812 (R)-[4-Fluoro-3-(7- morpholin-4-yl- pyrido[3,2-d}- pyrimidin-4-yl)- phenyl]-(3-methyl- pyrazin-2-yl)- methanolsee racemate::US10172859, Example 234::US11065253, Example 234::US9732094, Example 234
SMILES Cc1nccnc1[C@H](O)c1ccc(F)c(c1)-c1ncnc2cc(cnc12)N1CCOCC1
InChI Key InChIKey=JJEXYMGNEIIEPL-HSZRJFAPSA-N
Data  2 KI  3 IC50
  Tab Delimited (TSV)   2D SDfile   Computed 3D by Vconf -m prep SDfile
Find this compound or compounds like it in BindingDB:
Activity Spreadsheet -- Enzyme Inhibition Constant Data from BindingDB
Found 5 hits for monomerid = 315812
TargetPotassium voltage-gated channel subfamily H member 2(Homo sapiens (Human))
Merck Patent
US Patent
LigandPNGBDBM315812((R)-[4-Fluoro-3-(7- morpholin-4-yl- pyrido[3,2-d}-...)
Affinity DataKi: >2.50E+4nM. Assay description: The patch-clamp measurement was carried out at room temperature in whole-cell configuration on human embryonic kidney cells (HEK293) which have been ...
Ligand InfoPC cidPC sid
In DepthDetails US Patent
TargetPotassium voltage-gated channel subfamily H member 2(Homo sapiens (Human))
Merck Patent
US Patent
LigandPNGBDBM315812((R)-[4-Fluoro-3-(7- morpholin-4-yl- pyrido[3,2-d}-...)
Affinity DataKi: >2.50E+4nM. Assay description: Method for the detection and characterisation of test substances which interfere with the Kv11.1 (hERG) channel: Kv11.1 (hERG, human ether a-go-go re...
Ligand InfoPC cidPC sid
In DepthDetails US Patent
TargetDNA-dependent protein kinase catalytic subunit(Homo sapiens (Human))
Merck Patent
US Patent
LigandPNGBDBM315812((R)-[4-Fluoro-3-(7- morpholin-4-yl- pyrido[3,2-d}-...)
Affinity DataIC50: <3nM. Assay description: The kinase assay was carried out in streptavidin-coated 348-well microtitre flashplates. To this end, 1.5 μg of DNA-PK/protein complex and 100 n...
Ligand InfoPC cidPC sid
In DepthDetails US Patent
TargetDNA-dependent protein kinase catalytic subunit(Homo sapiens (Human))
Merck Patent
US Patent
LigandPNGBDBM315812((R)-[4-Fluoro-3-(7- morpholin-4-yl- pyrido[3,2-d}-...)
Affinity DataIC50: <3nM. Assay description: The kinase assay was carried out in streptavidin-coated 348-well microtitre flashplates. To this end, 1.5 μg of DNA-PK/protein complex and 100 n...
Ligand InfoPC cidPC sid
In DepthDetails US Patent
TargetDNA-dependent protein kinase catalytic subunit(Homo sapiens (Human))
Merck Patent
US Patent
LigandPNGBDBM315812((R)-[4-Fluoro-3-(7- morpholin-4-yl- pyrido[3,2-d}-...)
Affinity DataIC50: <3nM. Assay description: The kinase assay was carried out in streptavidin-coated 348-well microtitre flashplates. To this end, 1.5 ug of DNA-PK/protein complex and 100 ng of ...
Ligand InfoPC cidPC sid
In DepthDetails US Patent