BDBM31586 oxadiazole derivative, 20w
SMILES COc1ccc(cc1)-n1cnc2ccc(cc12)-c1nnc(SCc2cccc(c2)C(F)(F)F)o1
InChI Key InChIKey=NXAFWNNUIPXKKL-UHFFFAOYSA-N
Data  1 IC50
  Tab Delimited (TSV)   2D SDfile   Computed 3D by Vconf -m prep SDfile
Find this compound or compounds like it in BindingDB:
Activity Spreadsheet -- Enzyme Inhibition Constant Data from BindingDB
Found 1 hit for monomerid = 31586
TargetGlycogen synthase kinase-3 beta(Homo sapiens (Human))
Takeda Pharmaceutical
LigandPNGBDBM31586(oxadiazole derivative, 20w)
Affinity DataIC50:  2.5nMpH: 7.5 T: 2°C. Assay description: Human GSK-3beta was expressed as the N-terminal FLAG-tagged protein using a baculovirus expression system. The kinase assay was was conducted in a 96...
In DepthDetails ArticlePubMed