BDBM315947 US10172859, Example 371::US11065253, Example 371::US9732094, Example 371::[2-Chloro-5-(7- morpholin-4-yl- quinazolin-4-yl)- phenyl]-(9-methyl- 9H-purin-6-yl)- methanol1H NMR (500 MHz, DMSO-d6) ppm = 9.10 (s,1H), 8.90 (s, 1H), 8.59 (s, 1H), 8.38 (d, J = 2.2,1H), 8.12 (d, J = 9.4, 1H), 7.70 (dd, J = 8.8, 2.3, 1H),7.60 (dd, J = 9.5, 2.6, 1H), 7.56 (d, J = 8.2, 1H), 7.23(d, J = 2.6, 1H), 6.71 (d, J = 5.4, 1H), 6.53 (d, J = 5.4,1H), 3.86 (s, 3H), 3.82-3.77 (m, 4H), 3.49-3.45(m, 4H).
SMILES Cn1cnc2c(ncnc12)C(O)c1cc(ccc1Cl)-c1ncnc2cc(ccc12)N1CCOCC1
InChI Key InChIKey=SLTAVZNCQZTPAE-UHFFFAOYSA-N
Data  2 KI  3 IC50
  Tab Delimited (TSV)   2D SDfile   Computed 3D by Vconf -m prep SDfile
Find this compound or compounds like it in BindingDB:
Activity Spreadsheet -- Enzyme Inhibition Constant Data from BindingDB
Found 5 hits for monomerid = 315947
TargetPotassium voltage-gated channel subfamily H member 2(Homo sapiens (Human))
Merck Patent
US Patent
LigandPNGBDBM315947(US10172859, Example 371 | US11065253, Example 371 ...)
Affinity DataKi:  1.25E+4nM. Assay description: The patch-clamp measurement was carried out at room temperature in whole-cell configuration on human embryonic kidney cells (HEK293) which have been ...
Ligand InfoPC cidPC sid
In DepthDetails US Patent
TargetPotassium voltage-gated channel subfamily H member 2(Homo sapiens (Human))
Merck Patent
US Patent
LigandPNGBDBM315947(US10172859, Example 371 | US11065253, Example 371 ...)
Affinity DataKi:  1.25E+4nM. Assay description: Method for the detection and characterisation of test substances which interfere with the Kv11.1 (hERG) channel: Kv11.1 (hERG, human ether a-go-go re...
Ligand InfoPC cidPC sid
In DepthDetails US Patent
TargetDNA-dependent protein kinase catalytic subunit(Homo sapiens (Human))
Merck Patent
US Patent
LigandPNGBDBM315947(US10172859, Example 371 | US11065253, Example 371 ...)
Affinity DataIC50:  18.5nM. Assay description: The kinase assay was carried out in streptavidin-coated 348-well microtitre flashplates. To this end, 1.5 μg of DNA-PK/protein complex and 100 n...
Ligand InfoPC cidPC sid
In DepthDetails US Patent
TargetDNA-dependent protein kinase catalytic subunit(Homo sapiens (Human))
Merck Patent
US Patent
LigandPNGBDBM315947(US10172859, Example 371 | US11065253, Example 371 ...)
Affinity DataIC50:  18.5nM. Assay description: The kinase assay was carried out in streptavidin-coated 348-well microtitre flashplates. To this end, 1.5 μg of DNA-PK/protein complex and 100 n...
Ligand InfoPC cidPC sid
In DepthDetails US Patent
TargetDNA-dependent protein kinase catalytic subunit(Homo sapiens (Human))
Merck Patent
US Patent
LigandPNGBDBM315947(US10172859, Example 371 | US11065253, Example 371 ...)
Affinity DataIC50:  19nM. Assay description: The kinase assay was carried out in streptavidin-coated 348-well microtitre flashplates. To this end, 1.5 ug of DNA-PK/protein complex and 100 ng of ...
Ligand InfoPC cidPC sid
In DepthDetails US Patent