BDBM31603 pyrazole, 20
SMILES Cc1cc(on1)-c1c[nH]nc1-c1ccc(OCc2ccc3ccccc3n2)cc1
InChI Key InChIKey=JUQJCAMVXDQFCM-UHFFFAOYSA-N
Data  1 IC50
  Tab Delimited (TSV)   2D SDfile   Computed 3D by Vconf -m prep SDfile
Find this compound or compounds like it in BindingDB:
Activity Spreadsheet -- Enzyme Inhibition Constant Data from BindingDB
Found 1 hit for monomerid = 31603
LigandPNGBDBM31603(pyrazole, 20)
Affinity DataIC50:  413nMpH: 7.5 T: 2°C. Assay description: PDE activity was measured using a plate-based Scintillation Proximity Assay (SPA). For competitive enzyme inhibition assays, the substrate [3H]cAMP c...
Ligand InfoPC cidPC sid
In DepthDetails ArticlePubMed