BDBM316063 US9616064, Compound 1aw
SMILES COC(=O)c1ccc(Nc2ccnc(N)n2)cc1
InChI Key InChIKey=PPLGKCMIBNBMFF-UHFFFAOYSA-N
Data  2 IC50
  Tab Delimited (TSV)   2D SDfile   Computed 3D by Vconf -m prep SDfile
Find this compound or compounds like it in BindingDB:
Activity Spreadsheet -- Enzyme Inhibition Constant Data from BindingDB
Found 2 hits for monomerid = 316063
TargetRho-associated protein kinase 2(Homo sapiens (Human))
H. Lee Moffitt Cancer Center And Research Institute
US Patent
LigandPNGBDBM316063(US9616064, Compound 1aw)
Affinity DataIC50:  1.39E+4nM
In DepthDetails US Patent
TargetRho-associated protein kinase 1(Homo sapiens (Human))
H. Lee Moffitt Cancer Center And Research Institute
US Patent
LigandPNGBDBM316063(US9616064, Compound 1aw)
Affinity DataIC50:  2.05E+4nM. Assay description: The inventors undertook a screen of the NCI Diversity set using a Z-lyte FRET assay (Kang et al. (2009); Wu et al. (2010)) to measure kinase inhibiti...
In DepthDetails US Patent