BDBM316092 US9616064, Compound 24c
SMILES Nc1nccc(n1)-n1ccc2c(cccc12)C(=O)NCCc1ccccc1
InChI Key InChIKey=NDMKTJWCSWYAME-UHFFFAOYSA-N
Data  2 IC50
  Tab Delimited (TSV)   2D SDfile   Computed 3D by Vconf -m prep SDfile
Find this compound or compounds like it in BindingDB:
Activity Spreadsheet -- Enzyme Inhibition Constant Data from BindingDB
Found 2 hits for monomerid = 316092
TargetRho-associated protein kinase 2(Homo sapiens (Human))
H. Lee Moffitt Cancer Center And Research Institute
US Patent
LigandPNGBDBM316092(US9616064, Compound 24c)
Affinity DataIC50:  500nM
Ligand InfoPC cidPC sid
In DepthDetails US Patent
TargetRho-associated protein kinase 1(Homo sapiens (Human))
H. Lee Moffitt Cancer Center And Research Institute
US Patent
LigandPNGBDBM316092(US9616064, Compound 24c)
Affinity DataIC50:  2.00E+3nM. Assay description: The inventors undertook a screen of the NCI Diversity set using a Z-lyte FRET assay (Kang et al. (2009); Wu et al. (2010)) to measure kinase inhibiti...
Ligand InfoPC cidPC sid
In DepthDetails US Patent