BDBM31611 Aminopyridine N-oxide, 37
SMILES Nc1c(cc[n+]([O-])c1-c1ccc(Cl)cc1)C(=O)c1ccccc1
InChI Key InChIKey=GXTJOHAISBVKCF-UHFFFAOYSA-N
Data  1 IC50
  Tab Delimited (TSV)   2D SDfile   Computed 3D by Vconf -m prep SDfile
Find this compound or compounds like it in BindingDB:
Activity Spreadsheet -- Enzyme Inhibition Constant Data from BindingDB
Found 1 hit for monomerid = 31611
TargetMitogen-activated protein kinase 14(Homo sapiens (Human))
Almirall
LigandPNGBDBM31611(Aminopyridine N-oxide, 37)
Affinity DataIC50:  2.53E+3nMpH: 7.5 T: 2°C. Assay description: Enzymatic activity assay was performed in 96-well microtiter plates. Various concentrations of the test compound or vehicle controls were preincubate...
In DepthDetails ArticlePubMed