BDBM316110 US9616064, Compound 30j
SMILES C[C@H](NC(=O)c1cccc2n(ccc12)-c1ccnc(N)n1)c1ccccc1
InChI Key InChIKey=FMUUEJMHSBIUDF-AWEZNQCLSA-N
Data  2 IC50
  Tab Delimited (TSV)   2D SDfile   Computed 3D by Vconf -m prep SDfile
Find this compound or compounds like it in BindingDB:
Activity Spreadsheet -- Enzyme Inhibition Constant Data from BindingDB
Found 2 hits for monomerid = 316110
TargetRho-associated protein kinase 2(Homo sapiens (Human))
H. Lee Moffitt Cancer Center And Research Institute
US Patent
LigandPNGBDBM316110(US9616064, Compound 30j)
Affinity DataIC50:  1.20E+3nM
Ligand InfoPC cidPC sid
In DepthDetails US Patent
TargetRho-associated protein kinase 1(Homo sapiens (Human))
H. Lee Moffitt Cancer Center And Research Institute
US Patent
LigandPNGBDBM316110(US9616064, Compound 30j)
Affinity DataIC50:  3.43E+3nM. Assay description: The inventors undertook a screen of the NCI Diversity set using a Z-lyte FRET assay (Kang et al. (2009); Wu et al. (2010)) to measure kinase inhibiti...
Ligand InfoPC cidPC sid
In DepthDetails US Patent