BDBM316114 US9616064, Compound 30n
SMILES CC(=O)Nc1cccc(CNC(=O)c2cccc3n(ccc23)-c2ccnc(N)n2)c1
InChI Key InChIKey=UTDFUKRHURDFNU-UHFFFAOYSA-N
Data  1 IC50
  Tab Delimited (TSV)   2D SDfile   Computed 3D by Vconf -m prep SDfile
Find this compound or compounds like it in BindingDB:
Activity Spreadsheet -- Enzyme Inhibition Constant Data from BindingDB
Found 1 hit for monomerid = 316114
TargetRho-associated protein kinase 1(Homo sapiens (Human))
H. Lee Moffitt Cancer Center And Research Institute
US Patent
LigandPNGBDBM316114(US9616064, Compound 30n)
Affinity DataIC50:  1.39E+3nM. Assay description: The inventors undertook a screen of the NCI Diversity set using a Z-lyte FRET assay (Kang et al. (2009); Wu et al. (2010)) to measure kinase inhibiti...
Ligand InfoPC cidPC sid
In DepthDetails US Patent