BDBM316166 N-{6-[(6-{[2-(methylcarbamoyl)phenyl]thio}-1H-indazol-3-yl)ethynyl]pyridine-2-yl}-2,5,8,11-tetraoxatridecane-13-amide ::US9617222, Compound 41
SMILES CNC(=O)c1ccccc1Sc1ccc2c(n[nH]c2c1)C#Cc1ccc(NC(=O)COCCOCCOCCOC)cn1
InChI Key InChIKey=VDQMCOOMHILTSO-UHFFFAOYSA-N
Data  1 IC50
  Tab Delimited (TSV)   2D SDfile   Computed 3D by Vconf -m prep SDfile
Find this compound or compounds like it in BindingDB:
Activity Spreadsheet -- Enzyme Inhibition Constant Data from BindingDB
Found 1 hit for monomerid = 316166
TargetVascular endothelial growth factor receptor 2(Homo sapiens (Human))
Senju Pharmaceutical
US Patent
LigandPNGBDBM316166(N-{6-[(6-{[2-(methylcarbamoyl)phenyl]thio}-1H-inda...)
Affinity DataIC50:  4.30nM. Assay description: Measurement of the kinase inhibitory activity of each compound produced in Examples was conducted using the Off-chip Mobility Shift Assay. For this t...
Ligand InfoPC cidPC sid
In DepthDetails US Patent