BDBM316225 N-{2-Methoxy-5-[6-(2-methoxy-phenyl)-pyrimidin-4-ylamino]-phenyl}-2,2-dimethyl-propionamide::US10294218, Example 53::US9617225, Example 53
SMILES COc1ccc(Nc2cc(ncn2)-c2ccccc2OC)cc1NC(=O)C(C)(C)C
InChI Key InChIKey=VIURZHLUCZXIHD-UHFFFAOYSA-N
Data  2 IC50
  Tab Delimited (TSV)   2D SDfile   Computed 3D by Vconf -m prep SDfile
Find this compound or compounds like it in BindingDB:
Activity Spreadsheet -- Enzyme Inhibition Constant Data from BindingDB
Found 2 hits for monomerid = 316225
TargetCyclin-T1/Cyclin-dependent kinase 9(Homo sapiens (Human))
Virostatics
US Patent
LigandPNGBDBM316225(N-{2-Methoxy-5-[6-(2-methoxy-phenyl)-pyrimidin-4-y...)
Affinity DataIC50: <1.00E+3nM. Assay description: The activity of the compounds described in the present invention can be determined by measuring the phosphorylation of a fluorescently-labeled peptid...
Ligand InfoPC cidPC sid
In DepthDetails US Patent
TargetCyclin-dependent kinase 9(Homo sapiens (Human))
Virostatics
US Patent
LigandPNGBDBM316225(N-{2-Methoxy-5-[6-(2-methoxy-phenyl)-pyrimidin-4-y...)
Affinity DataIC50: <1.00E+3nM. Assay description: The activity of the compounds described in the present invention can be determined by measuring the phosphorylation of a fluorescently-labeled peptid...
Ligand InfoPC cidPC sid
In DepthDetails US Patent