BDBM316247 N1-[6-(5-Fluoro-2-methoxy-phenyl)- pyrimidin-4-yl]-4-methoxy-benzene-1,3- diamine::US10294218, Example 75::US9617225, Example 75
SMILES COc1ccc(Nc2cc(ncn2)-c2cc(F)ccc2OC)cc1N
InChI Key InChIKey=XMCWMZMZPXNMFT-UHFFFAOYSA-N
Data  2 IC50
  Tab Delimited (TSV)   2D SDfile   Computed 3D by Vconf -m prep SDfile
Find this compound or compounds like it in BindingDB:
Activity Spreadsheet -- Enzyme Inhibition Constant Data from BindingDB
Found 2 hits for monomerid = 316247
TargetCyclin-T1/Cyclin-dependent kinase 9(Homo sapiens (Human))
Virostatics
US Patent
LigandPNGBDBM316247(N1-[6-(5-Fluoro-2-methoxy-phenyl)- pyrimidin-4-yl]...)
Affinity DataIC50: <1.00E+3nM. Assay description: The activity of the compounds described in the present invention can be determined by measuring the phosphorylation of a fluorescently-labeled peptid...
Ligand InfoPC cidPC sid
In DepthDetails US Patent
TargetCyclin-dependent kinase 9(Homo sapiens (Human))
Virostatics
US Patent
LigandPNGBDBM316247(N1-[6-(5-Fluoro-2-methoxy-phenyl)- pyrimidin-4-yl]...)
Affinity DataIC50: <1.00E+3nM. Assay description: The activity of the compounds described in the present invention can be determined by measuring the phosphorylation of a fluorescently-labeled peptid...
Ligand InfoPC cidPC sid
In DepthDetails US Patent