BDBM316256 N-{5-[6-(4,5-Difluoro-2-methoxy-phenyl)-pyrimidin-4-ylamino]-2-methoxy-phenyl}-formamide::US10294218, Example 84::US9617225, Example 84
SMILES COc1ccc(Nc2cc(ncn2)-c2cc(F)c(F)cc2OC)cc1NC=O
InChI Key InChIKey=OGKRZVTZKBHVKD-UHFFFAOYSA-N
Data  2 IC50
  Tab Delimited (TSV)   2D SDfile   Computed 3D by Vconf -m prep SDfile
Find this compound or compounds like it in BindingDB:
Activity Spreadsheet -- Enzyme Inhibition Constant Data from BindingDB
Found 2 hits for monomerid = 316256
TargetCyclin-T1/Cyclin-dependent kinase 9(Homo sapiens (Human))
Virostatics
US Patent
LigandPNGBDBM316256(N-{5-[6-(4,5-Difluoro-2-methoxy-phenyl)-pyrimidin-...)
Affinity DataIC50: <1.00E+3nM. Assay description: The activity of the compounds described in the present invention can be determined by measuring the phosphorylation of a fluorescently-labeled peptid...
Ligand InfoKEGGPC cidPC sid
In DepthDetails US Patent
TargetCyclin-dependent kinase 9(Homo sapiens (Human))
Virostatics
US Patent
LigandPNGBDBM316256(N-{5-[6-(4,5-Difluoro-2-methoxy-phenyl)-pyrimidin-...)
Affinity DataIC50: <1.00E+3nM. Assay description: The activity of the compounds described in the present invention can be determined by measuring the phosphorylation of a fluorescently-labeled peptid...
Ligand InfoKEGGPC cidPC sid
In DepthDetails US Patent