BDBM316270 US10294218, Example 98::US9617225, Example 98::{2-Methoxy-5-[6-(2-methoxy-phenyl)-pyrimidin-4-ylamino]-phenyl}-methyl-carbamic acid methyl ester
SMILES COC(=O)N(C)c1cc(Nc2cc(ncn2)-c2ccccc2OC)ccc1OC
InChI Key InChIKey=HSHPDOXRJIYHAS-UHFFFAOYSA-N
Data  2 IC50
  Tab Delimited (TSV)   2D SDfile   Computed 3D by Vconf -m prep SDfile
Find this compound or compounds like it in BindingDB:
Activity Spreadsheet -- Enzyme Inhibition Constant Data from BindingDB
Found 2 hits for monomerid = 316270
TargetCyclin-T1/Cyclin-dependent kinase 9(Homo sapiens (Human))
Virostatics
US Patent
LigandPNGBDBM316270(US10294218, Example 98 | US9617225, Example 98 | {...)
Affinity DataIC50: <1.00E+3nM. Assay description: The activity of the compounds described in the present invention can be determined by measuring the phosphorylation of a fluorescently-labeled peptid...
Ligand InfoPC cidPC sid
In DepthDetails US Patent
TargetCyclin-dependent kinase 9(Homo sapiens (Human))
Virostatics
US Patent
LigandPNGBDBM316270(US10294218, Example 98 | US9617225, Example 98 | {...)
Affinity DataIC50: <1.00E+3nM. Assay description: The activity of the compounds described in the present invention can be determined by measuring the phosphorylation of a fluorescently-labeled peptid...
Ligand InfoPC cidPC sid
In DepthDetails US Patent