BDBM316284 2-Ethoxy-5-[6-(4-fluoro-2-methoxy- phenyl)-pyrimidin-4-ylamino]- benzamide::US10294218, Example 112::US9617225, Example 112
SMILES CCOc1ccc(Nc2cc(ncn2)-c2ccc(F)cc2OC)cc1C(N)=O
InChI Key InChIKey=VMRSZEYBIXKRMY-UHFFFAOYSA-N
Data  2 IC50
  Tab Delimited (TSV)   2D SDfile   Computed 3D by Vconf -m prep SDfile
Find this compound or compounds like it in BindingDB:
Activity Spreadsheet -- Enzyme Inhibition Constant Data from BindingDB
Found 2 hits for monomerid = 316284
TargetCyclin-T1/Cyclin-dependent kinase 9(Homo sapiens (Human))
Virostatics
US Patent
LigandPNGBDBM316284(2-Ethoxy-5-[6-(4-fluoro-2-methoxy- phenyl)-pyrimid...)
Affinity DataIC50: <1.00E+3nM. Assay description: The activity of the compounds described in the present invention can be determined by measuring the phosphorylation of a fluorescently-labeled peptid...
Ligand InfoPC cidPC sid
In DepthDetails US Patent
TargetCyclin-dependent kinase 9(Homo sapiens (Human))
Virostatics
US Patent
LigandPNGBDBM316284(2-Ethoxy-5-[6-(4-fluoro-2-methoxy- phenyl)-pyrimid...)
Affinity DataIC50: <1.00E+3nM. Assay description: The activity of the compounds described in the present invention can be determined by measuring the phosphorylation of a fluorescently-labeled peptid...
Ligand InfoPC cidPC sid
In DepthDetails US Patent