BDBM316300 5-[6-(4-Fluoro-2-methoxy-phenyl)- pyrimidin-4-ylamino]-2-methoxy- benzamide::US10294218, Example 128::US9617225, Example 128
SMILES COc1ccc(Nc2cc(ncn2)-c2ccc(F)cc2OC)cc1C(N)=O
InChI Key InChIKey=ZFCHUAOFIRTYII-UHFFFAOYSA-N
Data  2 IC50
  Tab Delimited (TSV)   2D SDfile   Computed 3D by Vconf -m prep SDfile
Find this compound or compounds like it in BindingDB:
Activity Spreadsheet -- Enzyme Inhibition Constant Data from BindingDB
Found 2 hits for monomerid = 316300
TargetCyclin-T1/Cyclin-dependent kinase 9(Homo sapiens (Human))
Virostatics
US Patent
LigandPNGBDBM316300(5-[6-(4-Fluoro-2-methoxy-phenyl)- pyrimidin-4-ylam...)
Affinity DataIC50: <1.00E+3nM. Assay description: The activity of the compounds described in the present invention can be determined by measuring the phosphorylation of a fluorescently-labeled peptid...
Ligand InfoPC cidPC sid
In DepthDetails US Patent
TargetCyclin-dependent kinase 9(Homo sapiens (Human))
Virostatics
US Patent
LigandPNGBDBM316300(5-[6-(4-Fluoro-2-methoxy-phenyl)- pyrimidin-4-ylam...)
Affinity DataIC50: <1.00E+3nM. Assay description: The activity of the compounds described in the present invention can be determined by measuring the phosphorylation of a fluorescently-labeled peptid...
Ligand InfoPC cidPC sid
In DepthDetails US Patent