BDBM316305 2-Methoxy-4-[6-(2-methoxy-phenyl)-pyrimidin-4-ylamino]-benzoic acid methyl ester::US10294218, Example 133::US9617225, Example 133
SMILES COC(=O)c1ccc(Nc2cc(ncn2)-c2ccccc2OC)cc1OC
InChI Key InChIKey=HDQCWWAIRDKFJS-UHFFFAOYSA-N
Data  4 IC50
  Tab Delimited (TSV)   2D SDfile   Computed 3D by Vconf -m prep SDfile
Find this compound or compounds like it in BindingDB:
Activity Spreadsheet -- Enzyme Inhibition Constant Data from BindingDB
Found 4 hits for monomerid = 316305
TargetCyclin-dependent kinase 9(Homo sapiens (Human))
Virostatics
US Patent
LigandPNGBDBM316305(2-Methoxy-4-[6-(2-methoxy-phenyl)-pyrimidin-4-ylam...)
Affinity DataIC50: <1.00E+3nM. Assay description: The activity of the compounds described in the present invention can be determined by measuring the phosphorylation of a fluorescently-labeled peptid...
Ligand InfoPC cidPC sid
In DepthDetails US Patent
TargetCyclin-T1/Cyclin-dependent kinase 9(Homo sapiens (Human))
Virostatics
US Patent
LigandPNGBDBM316305(2-Methoxy-4-[6-(2-methoxy-phenyl)-pyrimidin-4-ylam...)
Affinity DataIC50: <1.00E+3nM. Assay description: The activity of the compounds described in the present invention can be determined by measuring the phosphorylation of a fluorescently-labeled peptid...
Ligand InfoPC cidPC sid
In DepthDetails US Patent
TargetCyclin-T1/Cyclin-dependent kinase 9(Homo sapiens (Human))
Virostatics
US Patent
LigandPNGBDBM316305(2-Methoxy-4-[6-(2-methoxy-phenyl)-pyrimidin-4-ylam...)
Affinity DataIC50: <1.00E+3nM. Assay description: The activity of the compounds described in the present invention can be determined by measuring the phosphorylation of a fluorescently-labeled peptid...
Ligand InfoPC cidPC sid
In DepthDetails US Patent
TargetCyclin-dependent kinase 9(Homo sapiens (Human))
Virostatics
US Patent
LigandPNGBDBM316305(2-Methoxy-4-[6-(2-methoxy-phenyl)-pyrimidin-4-ylam...)
Affinity DataIC50: <1.00E+3nM. Assay description: The activity of the compounds described in the present invention can be determined by measuring the phosphorylation of a fluorescently-labeled peptid...
Ligand InfoPC cidPC sid
In DepthDetails US Patent