BDBM316307 N-(2-Hydroxy-ethyl)-2-methoxy-4-[6-(2-methoxy-phenyl)-pyrimidin-4-ylamino]-benzamide::US10294218, Example 135::US9617225, Example 135
SMILES COc1cc(Nc2cc(ncn2)-c2ccccc2OC)ccc1C(=O)NCCO
InChI Key InChIKey=CZZUDKKZSUZKFN-UHFFFAOYSA-N
Data  2 IC50
  Tab Delimited (TSV)   2D SDfile   Computed 3D by Vconf -m prep SDfile
Find this compound or compounds like it in BindingDB:
Activity Spreadsheet -- Enzyme Inhibition Constant Data from BindingDB
Found 2 hits for monomerid = 316307
TargetCyclin-T1/Cyclin-dependent kinase 9(Homo sapiens (Human))
Virostatics
US Patent
LigandPNGBDBM316307(N-(2-Hydroxy-ethyl)-2-methoxy-4-[6-(2-methoxy-phen...)
Affinity DataIC50: <1.00E+3nM. Assay description: The activity of the compounds described in the present invention can be determined by measuring the phosphorylation of a fluorescently-labeled peptid...
Ligand InfoKEGGPC cidPC sid
In DepthDetails US Patent
TargetCyclin-dependent kinase 9(Homo sapiens (Human))
Virostatics
US Patent
LigandPNGBDBM316307(N-(2-Hydroxy-ethyl)-2-methoxy-4-[6-(2-methoxy-phen...)
Affinity DataIC50: <1.00E+3nM. Assay description: The activity of the compounds described in the present invention can be determined by measuring the phosphorylation of a fluorescently-labeled peptid...
Ligand InfoKEGGPC cidPC sid
In DepthDetails US Patent