BDBM316398 US9617239, BRITE-355202
SMILES Clc1cc(sc1Oc1cccc(c1)N1CCNCC1)S(=O)(=O)NC1CCCC1
InChI Key InChIKey=IQTCBMLAKSNHNW-UHFFFAOYSA-N
Data  1 IC50
  Tab Delimited (TSV)   2D SDfile   Computed 3D by Vconf -m prep SDfile
Find this compound or compounds like it in BindingDB:
Activity Spreadsheet -- Enzyme Inhibition Constant Data from BindingDB
Found 1 hit for monomerid = 316398
TargetBeta-glucuronidase(Homo sapiens (Human))
North Carolina Central University
US Patent
LigandPNGBDBM316398(US9617239, BRITE-355202)
Affinity DataIC50:  510nM. Assay description: The β-glucuronidase assay was performed by the addition of 0.5 μl of compound (or DMSO) to the well of a black 384-well plate followed by t...
Ligand InfoPC cidPC sid
In DepthDetails US Patent