BDBM316425 US9617239, BRITE-355192
SMILES Clc1cc(sc1Sc1ccccn1)S(=O)(=O)NCc1cccc2ccccc12
InChI Key InChIKey=MJBUMSUJWXIPDQ-UHFFFAOYSA-N
Data  1 IC50
  Tab Delimited (TSV)   2D SDfile   Computed 3D by Vconf -m prep SDfile
Find this compound or compounds like it in BindingDB:
Activity Spreadsheet -- Enzyme Inhibition Constant Data from BindingDB
Found 1 hit for monomerid = 316425
TargetBeta-glucuronidase(Homo sapiens (Human))
North Carolina Central University
US Patent
LigandPNGBDBM316425(US9617239, BRITE-355192)
Affinity DataIC50:  1.61E+4nM. Assay description: The β-glucuronidase assay was performed by the addition of 0.5 μl of compound (or DMSO) to the well of a black 384-well plate followed by t...
Ligand InfoPC cidPC sid
In DepthDetails US Patent