BDBM316429 US9617239, BRITE-355018
SMILES CSc1ccc(Oc2ccc(s2)S(=O)(=O)NCc2cccc3ccccc23)cc1C
InChI Key InChIKey=PAUXCAVVPUVVKP-UHFFFAOYSA-N
Data  1 IC50
  Tab Delimited (TSV)   2D SDfile   Computed 3D by Vconf -m prep SDfile
Find this compound or compounds like it in BindingDB:
Activity Spreadsheet -- Enzyme Inhibition Constant Data from BindingDB
Found 1 hit for monomerid = 316429
TargetBeta-glucuronidase(Homo sapiens (Human))
North Carolina Central University
US Patent
LigandPNGBDBM316429(US9617239, BRITE-355018)
Affinity DataIC50:  2.33E+4nM. Assay description: The β-glucuronidase assay was performed by the addition of 0.5 μl of compound (or DMSO) to the well of a black 384-well plate followed by t...
Ligand InfoPC cidPC sid
In DepthDetails US Patent