BDBM316438 US9617239, BRITE-355214
SMILES CC(C)c1cc(C)cc(Oc2sc(cc2Cl)S(=O)(=O)NCc2cccc3ccccc23)c1
InChI Key InChIKey=DZWSOJBORKXPFR-UHFFFAOYSA-N
Data  1 IC50
  Tab Delimited (TSV)   2D SDfile   Computed 3D by Vconf -m prep SDfile
Find this compound or compounds like it in BindingDB:
Activity Spreadsheet -- Enzyme Inhibition Constant Data from BindingDB
Found 1 hit for monomerid = 316438
TargetBeta-glucuronidase(Homo sapiens (Human))
North Carolina Central University
US Patent
LigandPNGBDBM316438(US9617239, BRITE-355214)
Affinity DataIC50:  1.35E+5nM. Assay description: The β-glucuronidase assay was performed by the addition of 0.5 μl of compound (or DMSO) to the well of a black 384-well plate followed by t...
Ligand InfoPC cidPC sid
In DepthDetails US Patent