BDBM316541 4-(4-{[(3R)-1-acryloylpiperidin-3-yl]amino}-7H-pyrrolo[2,3-d]pyrimidin-5-yl)-N-(propan-2-yl)benzamide::US11111242, Example 29::US9617258, Example 29
SMILES CC(C)NC(=O)c1ccc(cc1)-c1c[nH]c2ncnc(N[C@@H]3CCCN(C3)C(=O)C=C)c12
InChI Key
Data  4 IC50
  Tab Delimited (TSV)   2D SDfile   Computed 3D by Vconf -m prep SDfile
Find this compound or compounds like it in BindingDB:
Activity Spreadsheet -- Enzyme Inhibition Constant Data from BindingDB
Found 4 hits for monomerid = 316541
TargetTyrosine-protein kinase JAK3(Homo sapiens (Human))
Pfizer
US Patent
LigandPNGBDBM316541(4-(4-{[(3R)-1-acryloylpiperidin-3-yl]amino}-7H-pyr...)
Affinity DataIC50:  6.60nM. Assay description: Test article was solubilized in dimethyl sulfoxide (DMSO) to a stock concentration of 30 mM. An 11-point half log dilution series was created in DMSO...
Ligand InfoPC cidPC sid
In DepthDetails US Patent
TargetTyrosine-protein kinase JAK3(Homo sapiens (Human))
Pfizer
US Patent
LigandPNGBDBM316541(4-(4-{[(3R)-1-acryloylpiperidin-3-yl]amino}-7H-pyr...)
Affinity DataIC50:  665nM. Assay description: JAK Caliper Enzyme Assay at 1 mM ATP: Test article was solubilized in dimethyl sulfoxide (DMSO) to a stock concentration of 30 mM. An 11-point half l...
Ligand InfoPC cidPC sid
In DepthDetails US Patent
TargetTyrosine-protein kinase JAK3(Homo sapiens (Human))
Pfizer
US Patent
LigandPNGBDBM316541(4-(4-{[(3R)-1-acryloylpiperidin-3-yl]amino}-7H-pyr...)
Affinity DataIC50:  6.60nM. Assay description: JAK Caliper Enzyme Assay at 4 μM: Test article was solubilized in dimethyl sulfoxide (DMSO) to a stock concentration of 30 mM. An 11-point half ...
Ligand InfoPC cidPC sid
In DepthDetails US Patent
TargetTyrosine-protein kinase JAK3(Homo sapiens (Human))
Pfizer
US Patent
LigandPNGBDBM316541(4-(4-{[(3R)-1-acryloylpiperidin-3-yl]amino}-7H-pyr...)
Affinity DataIC50:  665nM. Assay description: Test article was solubilized in dimethyl sulfoxide (DMSO) to a stock concentration of 30 mM. An 11-point half log dilution series was created in DMSO...
Ligand InfoPC cidPC sid
In DepthDetails US Patent