BDBM316619 (2E)-1-[(3R)-3-{[5-(2-methoxyethyl)-7H-pyrrolo[2,3-d]pyrimidin-4-yl]amino}pipendin-1-yl]but-2-en-1-one::US11111242, Example 109::US9617258, Example 109
SMILES COCCc1c[nH]c2ncnc(N[C@@H]3CCCN(C3)C(=O)\C=C\C)c12
InChI Key
Data  2 IC50
  Tab Delimited (TSV)   2D SDfile   Computed 3D by Vconf -m prep SDfile
Find this compound or compounds like it in BindingDB:
Activity Spreadsheet -- Enzyme Inhibition Constant Data from BindingDB
Found 2 hits for monomerid = 316619
TargetTyrosine-protein kinase JAK3(Homo sapiens (Human))
Pfizer
US Patent
LigandPNGBDBM316619((2E)-1-[(3R)-3-{[5-(2-methoxyethyl)-7H-pyrrolo[2,3...)
Affinity DataIC50:  2.82E+3nM. Assay description: JAK Caliper Enzyme Assay at 4 μM: Test article was solubilized in dimethyl sulfoxide (DMSO) to a stock concentration of 30 mM. An 11-point half ...
Ligand InfoPC cidPC sid
In DepthDetails US Patent
TargetTyrosine-protein kinase JAK3(Homo sapiens (Human))
Pfizer
US Patent
LigandPNGBDBM316619((2E)-1-[(3R)-3-{[5-(2-methoxyethyl)-7H-pyrrolo[2,3...)
Affinity DataIC50:  2.82E+3nM. Assay description: Test article was solubilized in dimethyl sulfoxide (DMSO) to a stock concentration of 30 mM. An 11-point half log dilution series was created in DMSO...
Ligand InfoPC cidPC sid
In DepthDetails US Patent