BDBM31667 imidazole-dioxolane, 19
SMILES Clc1ccc(CC[C@@]2(Cn3ccnc3)OC[C@@H](CSc3ccccc3Br)O2)cc1
InChI Key InChIKey=PZXYZQXJMKCCNI-SIKLNZKXSA-N
Data  2 IC50
  Tab Delimited (TSV)   2D SDfile   Computed 3D by Vconf -m prep SDfile
Find this compound or compounds like it in BindingDB:
Activity Spreadsheet -- Enzyme Inhibition Constant Data from BindingDB
Found 2 hits for monomerid = 31667
TargetHeme oxygenase 2(Rattus norvegicus (rat))
Queen'S University
LigandPNGBDBM31667(imidazole-dioxolane, 19)
Affinity DataIC50:  1.23E+4nMpH: 7.4Assay Description:HO activity in rat spleen (HO-1) and brain (HO-2) microsomal fractions was determined by the quantitation of CO formed from the degradation of methem...
In DepthDetails ArticlePubMed
TargetHeme oxygenase 1(Rattus norvegicus (rat))
Queen'S University
LigandPNGBDBM31667(imidazole-dioxolane, 19)
Affinity DataIC50:  6.00E+3nMpH: 7.4 T: 2°C. Assay description: HO activity in rat spleen (HO-1) and brain (HO-2) microsomal fractions was determined by the quantitation of CO formed from the degradation of methem...
In DepthDetails ArticlePubMed