BDBM31669 imidazole-dioxolane, 21
SMILES Oc1ccc(OC[C@@H]2CO[C@@](CCc3ccc(Cl)cc3)(Cn3ccnc3)O2)cc1
InChI Key InChIKey=XMQZZYKNICJHTB-FGZHOGPDSA-N
Data  4 IC50
  Tab Delimited (TSV)   2D SDfile   Computed 3D by Vconf -m prep SDfile
Find this compound or compounds like it in BindingDB:
Activity Spreadsheet -- Enzyme Inhibition Constant Data from BindingDB
Found 4 hits for monomerid = 31669
TargetHeme oxygenase 1(Rattus norvegicus (rat))
Queen'S University
LigandPNGBDBM31669(imidazole-dioxolane, 21)
Affinity DataIC50:  1.80E+3nMpH: 7.4 T: 2°C. Assay description: HO activity in rat spleen (HO-1) and brain (HO-2) microsomal fractions was determined by the quantitation of CO formed from the degradation of methem...
In DepthDetails ArticlePubMed
TargetCytochrome P450 3A1(Rattus norvegicus (rat))
Queen'S University
LigandPNGBDBM31669(imidazole-dioxolane, 21)
Affinity DataIC50:  2.00E+3nM. Assay description: CYP3A1/3A2-catalyzed erythromycin N-demethylase activity was determined by the spectrophotometric measurement of formaldehyde. Briefly, reaction mixt...
In DepthDetails ArticlePubMed
TargetCytochrome P450 2E1(Rattus norvegicus (rat))
Queen'S University
LigandPNGBDBM31669(imidazole-dioxolane, 21)
Affinity DataIC50: >1.00E+5nMpH: 7.4Assay Description:CYP2E1 hydroxylation of p-nitrophenol was determined by the spectrophotometric measurement of 4-nitrocatechol. Briefly, reaction mixture consisting o...
In DepthDetails ArticlePubMed
TargetHeme oxygenase 2(Rattus norvegicus (rat))
Queen'S University
LigandPNGBDBM31669(imidazole-dioxolane, 21)
Affinity DataIC50:  7.10E+3nMpH: 7.4Assay Description:HO activity in rat spleen (HO-1) and brain (HO-2) microsomal fractions was determined by the quantitation of CO formed from the degradation of methem...
In DepthDetails ArticlePubMed