BDBM316742 2-[(1-acryloylpiperidin-4-yl)amino]-N-{[(3R)-1-hydroxy-3-methylcyclopentyl]methyl}-5H-pyrrolo[2,3-b]pyrazine-7-carboxamide::US11111242, Example 239::US9617258, Example 239
SMILES C[C@@H]1CCC(O)(CNC(=O)c2c[nH]c3ncc(NC4CCN(CC4)C(=O)C=C)nc23)C1
InChI Key
Data  4 IC50
  Tab Delimited (TSV)   2D SDfile   Computed 3D by Vconf -m prep SDfile
Find this compound or compounds like it in BindingDB:
Activity Spreadsheet -- Enzyme Inhibition Constant Data from BindingDB
Found 4 hits for monomerid = 316742
TargetTyrosine-protein kinase JAK3(Homo sapiens (Human))
Pfizer
US Patent
LigandPNGBDBM316742(2-[(1-acryloylpiperidin-4-yl)amino]-N-{[(3R)-1-hyd...)
Affinity DataIC50:  0.5nM. Assay description: Test article was solubilized in dimethyl sulfoxide (DMSO) to a stock concentration of 30 mM. An 11-point half log dilution series was created in DMSO...
Ligand InfoPC cidPC sid
In DepthDetails US Patent
TargetTyrosine-protein kinase JAK3(Homo sapiens (Human))
Pfizer
US Patent
LigandPNGBDBM316742(2-[(1-acryloylpiperidin-4-yl)amino]-N-{[(3R)-1-hyd...)
Affinity DataIC50:  38.1nM. Assay description: JAK Caliper Enzyme Assay at 1 mM ATP: Test article was solubilized in dimethyl sulfoxide (DMSO) to a stock concentration of 30 mM. An 11-point half l...
Ligand InfoPC cidPC sid
In DepthDetails US Patent
TargetTyrosine-protein kinase JAK3(Homo sapiens (Human))
Pfizer
US Patent
LigandPNGBDBM316742(2-[(1-acryloylpiperidin-4-yl)amino]-N-{[(3R)-1-hyd...)
Affinity DataIC50:  0.5nM. Assay description: JAK Caliper Enzyme Assay at 4 μM: Test article was solubilized in dimethyl sulfoxide (DMSO) to a stock concentration of 30 mM. An 11-point half ...
Ligand InfoPC cidPC sid
In DepthDetails US Patent
TargetTyrosine-protein kinase JAK3(Homo sapiens (Human))
Pfizer
US Patent
LigandPNGBDBM316742(2-[(1-acryloylpiperidin-4-yl)amino]-N-{[(3R)-1-hyd...)
Affinity DataIC50:  38.1nM. Assay description: Test article was solubilized in dimethyl sulfoxide (DMSO) to a stock concentration of 30 mM. An 11-point half log dilution series was created in DMSO...
Ligand InfoPC cidPC sid
In DepthDetails US Patent