BDBM31679 imidazole-dioxolane, 2
SMILES C[C@@H]1CO[C@@](CCc2ccc(Cl)cc2)(Cn2ccnc2)O1
InChI Key InChIKey=PUVVRSXPYYFNAP-CZUORRHYSA-N
Data  2 IC50
  Tab Delimited (TSV)   2D SDfile   Computed 3D by Vconf -m prep SDfile
Find this compound or compounds like it in BindingDB:
Activity Spreadsheet -- Enzyme Inhibition Constant Data from BindingDB
Found 2 hits for monomerid = 31679
TargetHeme oxygenase 2(Rattus norvegicus (rat))
Queen'S University
LigandPNGBDBM31679(imidazole-dioxolane, 2)
Affinity DataIC50:  3.05E+5nMpH: 7.4Assay Description:HO activity in rat spleen (HO-1) and brain (HO-2) microsomal fractions was determined by the quantitation of CO formed from the degradation of methem...
In DepthDetails ArticlePubMed
TargetHeme oxygenase 1(Rattus norvegicus (rat))
Queen'S University
LigandPNGBDBM31679(imidazole-dioxolane, 2)
Affinity DataIC50:  800nMpH: 7.4Assay Description:HO activity in rat spleen (HO-1) and brain (HO-2) microsomal fractions was determined by the quantitation of CO formed from the degradation of methem...
In DepthDetails ArticlePubMed