BDBM316905 US9617262, Compound 20
SMILES O=C(\C=C\c1cnc2NC(=O)CCc2c1)N1C[C@H]2CN(C[C@H]2C1)c1cccnc1
InChI Key InChIKey=BZOYVPXHEPQRQA-XBJXIVSDSA-N
Data  1 IC50
  Tab Delimited (TSV)   2D SDfile   Computed 3D by Vconf -m prep SDfile
Find this compound or compounds like it in BindingDB:
Activity Spreadsheet -- Enzyme Inhibition Constant Data from BindingDB
Found 1 hit for monomerid = 316905
TargetEnoyl-[acyl-carrier-protein] reductase [NADPH] FabI(Staphylococcus aureus)
Janssen Ireland
US Patent
LigandPNGBDBM316905(US9617262, Compound 20)
Affinity DataIC50:  2.74E+3nM. Assay description: FabI enzyme inhibition assays were carried out in half-area, 384-well microtitre plates. Compounds were evaluated in 40-μl assay mixtures contai...
Ligand InfoPC cidPC sid
In DepthDetails US Patent