BDBM316930 US9617262, Compound 46
SMILES CCOC(=O)C1=CC2CN(CC2C1)C(=O)\C=C\c1cnc2NC(=O)CCc2c1
InChI Key InChIKey=VWLPXBOGRXQIPW-ZZXKWVIFSA-N
Data  1 IC50
  Tab Delimited (TSV)   2D SDfile   Computed 3D by Vconf -m prep SDfile
Find this compound or compounds like it in BindingDB:
Activity Spreadsheet -- Enzyme Inhibition Constant Data from BindingDB
Found 1 hit for monomerid = 316930
TargetEnoyl-[acyl-carrier-protein] reductase [NADPH] FabI(Staphylococcus aureus)
Janssen Ireland
US Patent
LigandPNGBDBM316930(US9617262, Compound 46)
Affinity DataIC50:  1.41E+3nM. Assay description: FabI enzyme inhibition assays were carried out in half-area, 384-well microtitre plates. Compounds were evaluated in 40-μl assay mixtures contai...
Ligand InfoPC cidPC sid
In DepthDetails US Patent