BDBM317041 N-[3-(4-Cyclopropyl-7H- pyrrolo[2,3-d]pyrimidine-5- carbonyl)-2,4-difluoro- phenyl]-2,5-difluoro- benzenesulfonamide::US9617267, Compound P-1107
SMILES Fc1ccc(F)c(c1)S(=O)(=O)Nc1ccc(F)c(C(=O)c2c[nH]c3ncnc(C4CC4)c23)c1F
InChI Key InChIKey=SJXWUCRWMDHAQR-UHFFFAOYSA-N
Data  6 IC50
  Tab Delimited (TSV)   2D SDfile   Computed 3D by Vconf -m prep SDfile
Find this compound or compounds like it in BindingDB:
Activity Spreadsheet -- Enzyme Inhibition Constant Data from BindingDB
Found 6 hits for monomerid = 317041
TargetCytochrome P450 1A2(Homo sapiens (Human))
Plexxikon
US Patent
LigandPNGBDBM317041(N-[3-(4-Cyclopropyl-7H- pyrrolo[2,3-d]pyrimidine-5...)
Affinity DataIC50:  7.50E+3nM. Assay description: The inhibition of CYP enzyme activity (IC50) for each of CYP1A2, CYP2C19, CYP2C9, CYP2D6, CYP3A4(BFC) and CYP3A4(BQ) is determined for compounds, whe...
Ligand InfoPC cidPC sid
In DepthDetails US Patent
TargetCytochrome P450 2C19(Homo sapiens (Human))
Plexxikon
US Patent
LigandPNGBDBM317041(N-[3-(4-Cyclopropyl-7H- pyrrolo[2,3-d]pyrimidine-5...)
Affinity DataIC50: >1.00E+4nM. Assay description: The inhibition of CYP enzyme activity (IC50) for each of CYP1A2, CYP2C19, CYP2C9, CYP2D6, CYP3A4(BFC) and CYP3A4(BQ) is determined for compounds, whe...
Ligand InfoPC cidPC sid
In DepthDetails US Patent
TargetCytochrome P450 3A4(Homo sapiens (Human))
Plexxikon
US Patent
LigandPNGBDBM317041(N-[3-(4-Cyclopropyl-7H- pyrrolo[2,3-d]pyrimidine-5...)
Affinity DataIC50: >1.00E+4nM. Assay description: The inhibition of CYP enzyme activity (IC50) for each of CYP1A2, CYP2C19, CYP2C9, CYP2D6, CYP3A4(BFC) and CYP3A4(BQ) is determined for compounds, whe...
Ligand InfoPC cidPC sid
In DepthDetails US Patent
TargetCytochrome P450 2D6(Homo sapiens (Human))
Plexxikon
US Patent
LigandPNGBDBM317041(N-[3-(4-Cyclopropyl-7H- pyrrolo[2,3-d]pyrimidine-5...)
Affinity DataIC50: >1.00E+4nM. Assay description: The inhibition of CYP enzyme activity (IC50) for each of CYP1A2, CYP2C19, CYP2C9, CYP2D6, CYP3A4(BFC) and CYP3A4(BQ) is determined for compounds, whe...
Ligand InfoPC cidPC sid
In DepthDetails US Patent
TargetCytochrome P450 3A4(Homo sapiens (Human))
Plexxikon
US Patent
LigandPNGBDBM317041(N-[3-(4-Cyclopropyl-7H- pyrrolo[2,3-d]pyrimidine-5...)
Affinity DataIC50: >1.00E+4nM. Assay description: The inhibition of CYP enzyme activity (IC50) for each of CYP1A2, CYP2C19, CYP2C9, CYP2D6, CYP3A4(BFC) and CYP3A4(BQ) is determined for compounds, whe...
Ligand InfoPC cidPC sid
In DepthDetails US Patent
TargetCytochrome P450 2C9(Homo sapiens (Human))
Plexxikon
US Patent
LigandPNGBDBM317041(N-[3-(4-Cyclopropyl-7H- pyrrolo[2,3-d]pyrimidine-5...)
Affinity DataIC50: >1.00E+4nM. Assay description: The inhibition of CYP enzyme activity (IC50) for each of CYP1A2, CYP2C19, CYP2C9, CYP2D6, CYP3A4(BFC) and CYP3A4(BQ) is determined for compounds, whe...
Ligand InfoPC cidPC sid
In DepthDetails US Patent