BDBM317087 US9617269, Compound WYQ-38
SMILES COc1cccc(Nc2nc3n(ncc3c(=O)[nH]2)C2CCCC2)c1
InChI Key InChIKey=WKHFZRSHMFJSKM-UHFFFAOYSA-N
Data  1 IC50
  Tab Delimited (TSV)   2D SDfile   Computed 3D by Vconf -m prep SDfile
Find this compound or compounds like it in BindingDB:
Activity Spreadsheet -- Enzyme Inhibition Constant Data from BindingDB
Found 1 hit for monomerid = 317087
TargetHigh affinity cGMP-specific 3',5'-cyclic phosphodiesterase 9A(Homo sapiens (Human))
Sun Yat-Sen University
US Patent
LigandPNGBDBM317087(US9617269, Compound WYQ-38)
Affinity DataIC50:  98nM. Assay description: Inhibition activities of all the N-substituted pyrazolo [3,4-d] pyrimidine ketone compounds according to the present invention to the phosphodiestera...
Ligand InfoPC cidPC sid
In DepthDetails US Patent