BDBM317131 US9617269, Compound WYQ-82
SMILES CC(C)Cn1ncc2c1nc(Nc1ccc(OC(C)C)cc1)[nH]c2=O
InChI Key InChIKey=DXXGDGGKIYYMBV-UHFFFAOYSA-N
Data  1 IC50
  Tab Delimited (TSV)   2D SDfile   Computed 3D by Vconf -m prep SDfile
Find this compound or compounds like it in BindingDB:
Activity Spreadsheet -- Enzyme Inhibition Constant Data from BindingDB
Found 1 hit for monomerid = 317131
TargetHigh affinity cGMP-specific 3',5'-cyclic phosphodiesterase 9A(Homo sapiens (Human))
Sun Yat-Sen University
US Patent
LigandPNGBDBM317131(US9617269, Compound WYQ-82)
Affinity DataIC50:  560nM. Assay description: Inhibition activities of all the N-substituted pyrazolo [3,4-d] pyrimidine ketone compounds according to the present invention to the phosphodiestera...
Ligand InfoPC cidPC sid
In DepthDetails US Patent