BDBM317188 8-Cyclopropyl-2,3-dimethyl-6-((1-methyl-3-(pyrrolidin-1-yl)-1H-1,2,4-triazol-5-yl)ethynyl)imidazo[1,2-b]pyridazine::US9617271, 46
SMILES Cc1nc2c(cc(nn2c1C)C#Cc1nc(nn1C)N1CCCC1)C1CC1
InChI Key InChIKey=PQWUHXREIWGRJB-UHFFFAOYSA-N
Data  1 IC50
  Tab Delimited (TSV)   2D SDfile   Computed 3D by Vconf -m prep SDfile
Find this compound or compounds like it in BindingDB:
Activity Spreadsheet -- Enzyme Inhibition Constant Data from BindingDB
Found 1 hit for monomerid = 317188
TargetcAMP and cAMP-inhibited cGMP 3',5'-cyclic phosphodiesterase 10A(Homo sapiens (Human))
Hoffmann-La Roche
US Patent
LigandPNGBDBM317188(8-Cyclopropyl-2,3-dimethyl-6-((1-methyl-3-(pyrroli...)
Affinity DataIC50:  1nM. Assay description: The human PDE10A full length assay was performed in 96-well micro titer plates. The reaction mixture of 50 μl contained 20 mM HEPES pH=7.5/10 mM...
Ligand InfoPC cidPC sid
In DepthDetails US Patent