BDBM317548 US9624188, 13::racemic
SMILES CC(C)CN(CC(C)C)c1ccc(cc1NC(=O)Nc1cc(C)no1)C(C)CC(O)=O
InChI Key InChIKey=CMONQYKXNSYVBH-UHFFFAOYSA-N
Data  1 IC50
  Tab Delimited (TSV)   2D SDfile   Computed 3D by Vconf -m prep SDfile
Find this compound or compounds like it in BindingDB:
Activity Spreadsheet -- Enzyme Inhibition Constant Data from BindingDB
Found 1 hit for monomerid = 317548
TargetIndoleamine 2,3-dioxygenase 1(Homo sapiens (Human))
Bristol-Myers Squibb
US Patent
LigandPNGBDBM317548(US9624188, 13 | racemic)
Affinity DataIC50:  3nM. Assay description: Human IDO1/HEK293 cells were seeded at 10,000 cells per 50 uL per well with RPMI/phenol red free media contains 10% FBS in a 384-well black wall clea...
Ligand InfoPC cidPC sid
In DepthDetails US Patent