BDBM317621 US10640491, Compound 10::US11104668, Compound 10::US9624201, Compound 10::{5-Amino-1- [4-(2,3- difluoro- phenoxy)-2- methyl- phenyl]-1H- pyrazol-4-yl}- [4-(1H- pyrazol-4-yl)- 1H-indol-2-yl]- methanone
SMILES Cc1cc(Oc2cccc(F)c2F)ccc1-n1ncc(C(=O)c2cc3c(cccc3[nH]2)-c2cn[nH]c2)c1N
InChI Key InChIKey=GTHMJPSFOVOCIS-UHFFFAOYSA-N
Data  3 IC50
  Tab Delimited (TSV)   2D SDfile   Computed 3D by Vconf -m prep SDfile
Find this compound or compounds like it in BindingDB:
Activity Spreadsheet -- Enzyme Inhibition Constant Data from BindingDB
Found 3 hits for monomerid = 317621
TargetTyrosine-protein kinase BTK(Homo sapiens (Human))
F. Hoffmann-La Roche
US Patent
LigandPNGBDBM317621(US10640491, Compound 10 | US11104668, Compound 10 ...)
Affinity DataIC50:  4.21nM. Assay description: The assay is a capture of radioactive 33P phosphorylated product through filtration. The interactions of Btk, biotinylated SH2 peptide substrate (Src...
Ligand InfoPC cidPC sid
In DepthDetails US Patent
TargetTyrosine-protein kinase BTK(Homo sapiens (Human))
F. Hoffmann-La Roche
US Patent
LigandPNGBDBM317621(US10640491, Compound 10 | US11104668, Compound 10 ...)
Affinity DataIC50:  4.21nM. Assay description: This BTK competition assay measures compound potency (IC50) for the inactivated state of Bruton's Tyrosine Kinase using FRET (Förster/Fluorescenc...
Ligand InfoPC cidPC sid
In DepthDetails US Patent
TargetTyrosine-protein kinase BTK(Homo sapiens (Human))
F. Hoffmann-La Roche
US Patent
LigandPNGBDBM317621(US10640491, Compound 10 | US11104668, Compound 10 ...)
Affinity DataIC50:  4.21nM. Assay description: This BTK competition assay measures compound potency (IC50) for the inactivated state of Bruton's Tyrosine Kinase using FRET (Förster/Flouresence...
Ligand InfoPC cidPC sid
In DepthDetails US Patent