BDBM317741 US9624213, Compound P-0237
SMILES CN(C)S(=O)(=O)Nc1ccc(F)c(C(=O)c2c[nH]c3ncc(cc23)-c2ccc(cc2)C2(CC2)[N+]#[C-])c1F
InChI Key InChIKey=ZLMCSJGIOXHDRP-UHFFFAOYSA-N
Data  1 IC50
  Tab Delimited (TSV)   2D SDfile   Computed 3D by Vconf -m prep SDfile
Find this compound or compounds like it in BindingDB:
Activity Spreadsheet -- Enzyme Inhibition Constant Data from BindingDB
Found 1 hit for monomerid = 317741
TargetSerine/threonine-protein kinase B-raf [V600E](Homo sapiens (Human))
Plexxikon
US Patent
LigandPNGBDBM317741(US9624213, Compound P-0237)
Affinity DataIC50: <100nM. Assay description: Assays for biochemical and cell based activity are known in the art, for example, as described in PCT publication WO 2007/002433, the disclosure of w...
Ligand InfoPC cidPC sid
In DepthDetails US Patent