BDBM317899 US10399976, Compound 52::US10807980, Compound 52::US11535614, Compound 52::US9624217, Compound 52
SMILES CCS(=O)(=O)c1ccc(CNC(=O)c2cnc3[C@@H]([C@H]4CCOC4)N(Cc4ccc(cc4)C#N)Cc3c2)cc1
InChI Key InChIKey=SHNFDLBCYXUGSS-NEKDWFFYSA-N
Data  4 KI  2 IC50
  Tab Delimited (TSV)   2D SDfile   Computed 3D by Vconf -m prep SDfile
Find this compound or compounds like it in BindingDB:
Activity Spreadsheet -- Enzyme Inhibition Constant Data from BindingDB
Found 6 hits for monomerid = 317899
TargetNuclear receptor ROR-gamma(Homo sapiens (Human))
Vitae Pharmaceuticals
US Patent
LigandPNGBDBM317899(US10399976, Compound 52 | US10807980, Compound 52 ...)
Affinity DataKi:  550nM. Assay description: Compounds of the present invention were tested for ability to bind to RORγ in a cell-free competition assay with commercially available radio-li...
Ligand InfoPC cidPC sid
In DepthDetails US Patent
TargetNuclear receptor ROR-gamma(Homo sapiens (Human))
Vitae Pharmaceuticals
US Patent
LigandPNGBDBM317899(US10399976, Compound 52 | US10807980, Compound 52 ...)
Affinity DataKi:  550nM. Assay description: Compounds of the present invention were tested for ability to bind to ROR gamma in a cell-free competition assay with commercially available radio-li...
Ligand InfoPC cidPC sid
In DepthDetails US Patent
TargetNuclear receptor ROR-gamma(Homo sapiens (Human))
Vitae Pharmaceuticals
US Patent
LigandPNGBDBM317899(US10399976, Compound 52 | US10807980, Compound 52 ...)
Affinity DataKi:  550nM. Assay description: Compounds of the present invention were tested for ability to bind to RORγ in a cell-free competition assay with commercially available radio-li...
Ligand InfoPC cidPC sid
In DepthDetails US Patent
TargetNuclear receptor ROR-gamma(Homo sapiens (Human))
Vitae Pharmaceuticals
US Patent
LigandPNGBDBM317899(US10399976, Compound 52 | US10807980, Compound 52 ...)
Affinity DataKi:  550nM. Assay description: Compounds of the present invention were tested for ability to bind to RORγ in a cell-free competition assay with commercially available radio-li...
Ligand InfoPC cidPC sid
In DepthDetails US Patent
TargetNuclear receptor ROR-gamma(Homo sapiens (Human))
Vitae Pharmaceuticals
US Patent
LigandPNGBDBM317899(US10399976, Compound 52 | US10807980, Compound 52 ...)
Affinity DataIC50:  550nM. Assay description: Compounds of the present invention were tested for RORγ inverse agonist activity in a cell-based, transcriptional activity assay. Secreted Nanol...
Ligand InfoPC cidPC sid
In DepthDetails US Patent
TargetNuclear receptor ROR-gamma(Homo sapiens (Human))
Vitae Pharmaceuticals
US Patent
LigandPNGBDBM317899(US10399976, Compound 52 | US10807980, Compound 52 ...)
Affinity DataIC50:  550nM. Assay description: Compounds of the present invention were tested for ROR gamma inverse agonist activity in a cell-based, transcriptional activity assay. Secreted Nanol...
Ligand InfoPC cidPC sid
In DepthDetails US Patent