BDBM317900 US10807980, Compound 53::US11535614, Compound 53::US9624217, Compound 53
SMILES CCS(=O)(=O)c1ccc(CNC(=O)c2cnc3[C@@H](C(C)C)N(C[C@H]4CC[C@@H](CC4)C(F)(F)F)Cc3c2)nc1
InChI Key InChIKey=XUYMIRYNRKXKOR-IOZGHAEBSA-N
Data  3 KI
  Tab Delimited (TSV)   2D SDfile   Computed 3D by Vconf -m prep SDfile
Find this compound or compounds like it in BindingDB:
Activity Spreadsheet -- Enzyme Inhibition Constant Data from BindingDB
Found 3 hits for monomerid = 317900
TargetNuclear receptor ROR-gamma(Homo sapiens (Human))
Vitae Pharmaceuticals
US Patent
LigandPNGBDBM317900(US10807980, Compound 53 | US11535614, Compound 53 ...)
Affinity DataKi:  550nM. Assay description: Compounds of the present invention were tested for ability to bind to RORγ in a cell-free competition assay with commercially available radio-li...
Ligand InfoPC cidPC sid
In DepthDetails US Patent
TargetNuclear receptor ROR-gamma(Homo sapiens (Human))
Vitae Pharmaceuticals
US Patent
LigandPNGBDBM317900(US10807980, Compound 53 | US11535614, Compound 53 ...)
Affinity DataKi:  550nM. Assay description: Compounds of the present invention were tested for ability to bind to RORγ in a cell-free competition assay with commercially available radio-li...
Ligand InfoPC cidPC sid
In DepthDetails US Patent
TargetNuclear receptor ROR-gamma(Homo sapiens (Human))
Vitae Pharmaceuticals
US Patent
LigandPNGBDBM317900(US10807980, Compound 53 | US11535614, Compound 53 ...)
Affinity DataKi:  550nM. Assay description: Compounds of the present invention were tested for ability to bind to RORγ in a cell-free competition assay with commercially available radio-li...
Ligand InfoPC cidPC sid
In DepthDetails US Patent