BDBM317993 US10399976, Compound 146::US10807980, Compound 146::US9624217, Compound 146
SMILES CC(C)[C@@H]1N(Cc2ccc(cc2)C(F)(F)F)Cc2cc(cnc12)C(=O)NCC1(CCOCC1)C(O)=O
InChI Key InChIKey=YJCCLTDXFNHOPU-QFIPXVFZSA-N
Data  3 KI
  Tab Delimited (TSV)   2D SDfile   Computed 3D by Vconf -m prep SDfile
Find this compound or compounds like it in BindingDB:
Activity Spreadsheet -- Enzyme Inhibition Constant Data from BindingDB
Found 3 hits for monomerid = 317993
TargetNuclear receptor ROR-gamma(Homo sapiens (Human))
Vitae Pharmaceuticals
US Patent
LigandPNGBDBM317993(US10399976, Compound 146 | US10807980, Compound 14...)
Affinity DataKi: >1.00E+3nM. Assay description: Compounds of the present invention were tested for ability to bind to RORγ in a cell-free competition assay with commercially available radio-li...
Ligand InfoPC cidPC sid
In DepthDetails US Patent
TargetNuclear receptor ROR-gamma(Homo sapiens (Human))
Vitae Pharmaceuticals
US Patent
LigandPNGBDBM317993(US10399976, Compound 146 | US10807980, Compound 14...)
Affinity DataKi: >1.00E+3nM. Assay description: Compounds of the present invention were tested for ability to bind to RORγ in a cell-free competition assay with commercially available radio-li...
Ligand InfoPC cidPC sid
In DepthDetails US Patent
TargetNuclear receptor ROR-gamma(Homo sapiens (Human))
Vitae Pharmaceuticals
US Patent
LigandPNGBDBM317993(US10399976, Compound 146 | US10807980, Compound 14...)
Affinity DataKi: >1.00E+3nM. Assay description: Compounds of the present invention were tested for ability to bind to ROR gamma in a cell-free competition assay with commercially available radio-li...
Ligand InfoPC cidPC sid
In DepthDetails US Patent