BDBM318026 2-[4-[(3-Fluoro-2-pyridyl)methyl]piperazin-1-yl]-8-methyl-3,5,6,7-tetrahydropyrido[2,3-d]pyrimidin-4-one::US9624218, Example 20::US9624218, Example 28
SMILES CN1CCCc2c1nc([nH]c2=O)N1CCN(Cc2ncccc2F)CC1
InChI Key InChIKey=MXRLSJYSHPXDBN-UHFFFAOYSA-N
Data  5 IC50
  Tab Delimited (TSV)   2D SDfile   Computed 3D by Vconf -m prep SDfile
Find this compound or compounds like it in BindingDB:
Activity Spreadsheet -- Enzyme Inhibition Constant Data from BindingDB
Found 5 hits for monomerid = 318026
TargetPoly [ADP-ribose] polymerase tankyrase-1(Homo sapiens (Human))
Eli Lilly
US Patent
LigandPNGBDBM318026(2-[4-[(3-Fluoro-2-pyridyl)methyl]piperazin-1-yl]-8...)
Affinity DataIC50:  31.8nM. Assay description: The enzymatic activity of hTNKS1 and hTNKS2 is assessed using an enzyme-linked immunosorbent assay (ELISA) which detects poly ADP ribose incorporated...
Ligand InfoPC cidPC sid
In DepthDetails US Patent
TargetPoly [ADP-ribose] polymerase tankyrase-2(Homo sapiens (Human))
Eli Lilly
US Patent
LigandPNGBDBM318026(2-[4-[(3-Fluoro-2-pyridyl)methyl]piperazin-1-yl]-8...)
Affinity DataIC50:  11.3nM. Assay description: The enzymatic activity of hTNKS1 and hTNKS2 is assessed using an enzyme-linked immunosorbent assay (ELISA) which detects poly ADP ribose incorporated...
Ligand InfoPC cidPC sid
In DepthDetails US Patent
TargetPoly [ADP-ribose] polymerase 1(Homo sapiens (Human))
Eli Lilly
US Patent
LigandPNGBDBM318026(2-[4-[(3-Fluoro-2-pyridyl)methyl]piperazin-1-yl]-8...)
Affinity DataIC50:  8.24E+3nM. Assay description: The Poly ADP-ribose polymerase 1(PARP1) assay is an ELISA which detects poly ADP ribose incorporated into plate-bound histone protein in a 384-well f...
Ligand InfoPC cidPC sid
In DepthDetails US Patent
TargetPoly [ADP-ribose] polymerase tankyrase-2(Homo sapiens (Human))
Eli Lilly
US Patent
LigandPNGBDBM318026(2-[4-[(3-Fluoro-2-pyridyl)methyl]piperazin-1-yl]-8...)
Affinity DataIC50:  35.8nM. Assay description: The enzymatic activity of hTNKS1 and hTNKS2 is assessed using an enzyme-linked immunosorbent assay (ELISA) which detects poly ADP ribose incorporated...
Ligand InfoPC cidPC sid
In DepthDetails US Patent
TargetPoly [ADP-ribose] polymerase tankyrase-1(Homo sapiens (Human))
Eli Lilly
US Patent
LigandPNGBDBM318026(2-[4-[(3-Fluoro-2-pyridyl)methyl]piperazin-1-yl]-8...)
Affinity DataIC50:  29.5nM. Assay description: The enzymatic activity of hTNKS1 and hTNKS2 is assessed using an enzyme-linked immunosorbent assay (ELISA) which detects poly ADP ribose incorporated...
Ligand InfoPC cidPC sid
In DepthDetails US Patent