BDBM318046 (S)-5-benzyl-2-(2,2-diphenylacetyl)-2,3,4,5-tetrahydro-1H-pyrido[3,4-b]indole-3-carboxylic acid::US9624234, 1
SMILES OC(=O)[C@@H]1CC2=C3C(Cc4ccccc4)C=CC=C3N=C2CN1C(=O)C(c1ccccc1)c1ccccc1
InChI Key InChIKey=LTQNDFHYLHPXEY-QFCCLOIZSA-N
Data  1 IC50
  Tab Delimited (TSV)   2D SDfile   Computed 3D by Vconf -m prep SDfile
Find this compound or compounds like it in BindingDB:
Activity Spreadsheet -- Enzyme Inhibition Constant Data from BindingDB
Found 1 hit for monomerid = 318046
TargetType-2 angiotensin II receptor(Homo sapiens (Human))
Novartis
US Patent
LigandPNGBDBM318046( (S)-5-benzyl-2-(2,2-diphenylacetyl)-2,3,4,5-tetra...)
Affinity DataIC50:  210nM. Assay description: 120 μL membrane (5 mg protein/well) was incubated with 15 μL of [125I]-CGP42112A and 15 μL of compound at RT for 1.5 hrs.The binding r...
Ligand InfoPC cidPC sid
In DepthDetails US Patent